Target
Delta-type opioid receptor
Ligand
BDBM50002049
Substrate
Meas. Tech.
ChEMBL_304038 (CHEMBL840216)
Ki
5.8±n/a nM
Citation
 Peng, YKeenan, SMZhang, QKholodovych, VWelsh, WJ 3D-QSAR comparative molecular field analysis on opioid receptor antagonists: pooling data from different studies. J Med Chem 48:1620-9 (2005)  
Target
Name:
Delta-type opioid receptor
Synonyms:
Cytochrome P450 3A4 Delta opioid receptor Delta-type opioid receptor (DOR) OPRD_RAT Opioid receptor Opioid receptors; mu & delta Ror-a | Voltage-gated potassium channel
Type:
G Protein-Coupled Receptor (GPCR)
Mol. Mass.:
40465.04
Organism:
Rattus norvegicus (rat)
Description:
Competition binding assays were using CHO-K1 cell membranes expressing the opioid receptor.
Residue:
372
  
Inhibitor
Name:
BDBM50002049
Synonyms:
CHEMBL608246
Type:
Small organic molecule
Emp. Form.:
C26H28N2O3
Mol. Mass.:
416.5121
SMILES:
[H][C@@]12Cc3ccc(O)c4O[C@@]5(C)c6[nH]c7ccccc7c6C[C@]1(OCC)[C@@]5(CCN2C)c34
: