Target
Delta-type opioid receptor
Ligand
BDBM50002113
Substrate
Meas. Tech.
ChEMBL_304038 (CHEMBL840216)
Ki
3.7±n/a nM
Citation
 Peng, YKeenan, SMZhang, QKholodovych, VWelsh, WJ 3D-QSAR comparative molecular field analysis on opioid receptor antagonists: pooling data from different studies. J Med Chem 48:1620-9 (2005)  
Target
Name:
Delta-type opioid receptor
Synonyms:
Cytochrome P450 3A4 Delta opioid receptor Delta-type opioid receptor (DOR) OPRD_RAT Opioid receptor Opioid receptors; mu & delta Ror-a | Voltage-gated potassium channel
Type:
G Protein-Coupled Receptor (GPCR)
Mol. Mass.:
40465.04
Organism:
Rattus norvegicus (rat)
Description:
Competition binding assays were using CHO-K1 cell membranes expressing the opioid receptor.
Residue:
372
  
Inhibitor
Name:
BDBM50002113
Synonyms:
CHEMBL195879
Type:
Small organic molecule
Emp. Form.:
C26H22Cl2N2O2
Mol. Mass.:
465.371
SMILES:
[H][C@@]12Oc3c4c(CC5N(C)CCC14[C@@]5([H])Cc1cc(cnc21)-c1ccc(Cl)c(Cl)c1)ccc3O
: