Target
Beta-3 adrenergic receptor
Ligand
BDBM50422411
Substrate
Meas. Tech.
ChEMBL_352666 (CHEMBL862145)
EC50
16±n/a nM
Citation
 Uehling, DEShearer, BGDonaldson, KHChao, EYDeaton, DNAdkison, KKBrown, KKCariello, NFFaison, WLLancaster, MELin, JHart, RMilliken, TOPaulik, MASherman, BWSugg, EECowan, C Biarylaniline phenethanolamines as potent and selective beta3 adrenergic receptor agonists. J Med Chem 49:2758-71 (2006)  
Target
Name:
Beta-3 adrenergic receptor
Synonyms:
ADRB3 ADRB3_HUMAN Beta-2 adrenergic receptor and beta-3 adrenergic receptor Beta-3 adrenoreceptor | adrenergic Beta3
Type:
G Protein-Coupled Receptor (GPCR)
Mol. Mass.:
43534.88
Organism:
Homo sapiens (Human)
Description:
Residue:
408
  
Inhibitor
Name:
BDBM50422411
Synonyms:
CHEMBL154419
Type:
Small organic molecule
Emp. Form.:
C19H23ClN2O3
Mol. Mass.:
362.851
SMILES:
C[C@H](CNc1ccc(CC(O)=O)cc1)NC[C@H](O)c1cccc(Cl)c1
: