Target
Prothrombin
Ligand
BDBM50003299
Substrate
Meas. Tech.
ChEMBL_548421 (CHEMBL1030955)
IC50
19600±n/a nM
Citation
 Kimura, JIshizuka, ENakao, YYoshida, WYScheuer, PJKelly-Borges, M Isolation of 1-Methylherbipoline Salts of Halisulfate-1 and of Suvanine as Serine Protease Inhibitors from a Marine Sponge, Coscinoderma mathewsi J Nat Prod 61:248-50 (1998)  
Target
Name:
Prothrombin
Synonyms:
Activation peptide fragment 1 Coagulation factor II Prothrombin precursor Thrombin heavy chain | Thrombin light chain
Type:
Protein
Mol. Mass.:
70029.57
Organism:
Homo sapiens (Human)
Description:
P00734
Residue:
622
  
Inhibitor
Name:
BDBM50003299
Synonyms:
CHEMBL469919
Type:
Small organic molecule
Emp. Form.:
C24H35NaO5S
Mol. Mass.:
458.586
SMILES:
[Na+].[H][C@]12CCCC(C)(C)[C@]1([H])CC[C@]1(C)[C@@H](CCc3ccoc3)\C(CC[C@]21[H])=C\OS([O-])(=O)=O
: