Target
Histidine-rich protein PFHRP-II
Ligand
BDBM50003658
Substrate
Meas. Tech.
ChEMBL_500704 (CHEMBL966920)
IC50
17500±n/a nM
Citation
 Sunduru, NSrivastava, KRajakumar, SPuri, SKSaxena, JKChauhan, PM Synthesis of novel thiourea, thiazolidinedione and thioparabanic acid derivatives of 4-aminoquinoline as potent antimalarials. Bioorg Med Chem Lett 19:2570-3 (2009)  
Target
Name:
Histidine-rich protein PFHRP-II
Synonyms:
HRP1_PLAFA Histidine-rich protein PFHRP-II
Type:
PROTEIN
Mol. Mass.:
35156.49
Organism:
Plasmodium falciparum
Description:
ChEMBL_500704
Residue:
332
  
Inhibitor
Name:
BDBM50003658
Synonyms:
CHEMBL466906
Type:
Small organic molecule
Emp. Form.:
C17H23ClN4S
Mol. Mass.:
350.909
SMILES:
CCCCNC(=S)NCCCNc1ccnc2cc(Cl)ccc12
: