Target
Peroxisome proliferator-activated receptor gamma
Ligand
BDBM50004750
Substrate
Meas. Tech.
ChEMBL_922064 (CHEMBL3077606)
EC50
0.71±n/a nM
Citation
  TBA Med Chem Res 22:287-302 (2013)    Article 
Target
Name:
Peroxisome proliferator-activated receptor gamma
Synonyms:
NR1C3 PPAR-gamma PPARG_HUMAN Peroxisome proliferator-activated receptor gamma (PPAR gamma) Peroxisome proliferator-activated receptor gamma (PPARĪ³) peroxisome proliferator-activated receptor gamma isoform 2
Type:
Nuclear Receptor
Mol. Mass.:
57613.46
Organism:
Homo sapiens (Human)
Description:
P37231
Residue:
505
  
Inhibitor
Name:
BDBM50004750
Synonyms:
CHEMBL2282520
Type:
Small organic molecule
Emp. Form.:
C29H27NO7
Mol. Mass.:
501.5272
SMILES:
COC(=O)c1ccccc1[C@@](O)(Cc1ccc(OCCc2nc(oc2C)-c2ccccc2)cc1)C(O)=O
: