Target
Luciferin 4-monooxygenase
Ligand
BDBM50004844
Substrate
Meas. Tech.
ChEMBL_938513 (CHEMBL2327197)
IC50
417±n/a nM
Citation
 Poutiainen, PKPalvimo, JJHinkkanen, AEValkonen, AVäisänen, TKLaatikainen, RPulkkinen, JT Discovery of 5-benzyl-3-phenyl-4,5-dihydroisoxazoles and 5-benzyl-3-phenyl-1,4,2-dioxazoles as potent firefly luciferase inhibitors. J Med Chem 56:1064-73 (2013)  
Target
Name:
Luciferin 4-monooxygenase
Synonyms:
LUCI_PHOPY | Luciferase
Type:
PROTEIN
Mol. Mass.:
60747.46
Organism:
Photinus pyralis
Description:
ChEMBL_938513
Residue:
550
  
Inhibitor
Name:
BDBM50004844
Synonyms:
CHEMBL2324048
Type:
Small organic molecule
Emp. Form.:
C16H14ClNO
Mol. Mass.:
271.741
SMILES:
Clc1ccc(cc1)C1=NO[C@@H](Cc2ccccc2)C1
: