Target
Carbonic anhydrase 2
Ligand
BDBM50004940
Substrate
Meas. Tech.
ChEMBL_960000 (CHEMBL2384053)
Ki
305±n/a nM
Citation
 Carta, FAkdemir, AScozzafava, AMasini, ESupuran, CT Xanthates and trithiocarbonates strongly inhibit carbonic anhydrases and show antiglaucoma effects in vivo. J Med Chem 56:4691-700 (2013)  
Target
Name:
Carbonic anhydrase 2
Synonyms:
CA-II CAC Carbonate dehydratase II Carbonic anhydrase 2 (CA-II) Carbonic anhydrase C Carbonic anhydrase II (CA-II) Carbonic anhydrase II (hCA II) | Carbonic anhydrase isoenzyme II (hCA II)
Type:
Enzyme
Mol. Mass.:
29250.71
Organism:
Homo sapiens (Human)
Description:
P00918
Residue:
260
  
Inhibitor
Name:
BDBM50004940
Synonyms:
CHEMBL2380738
Type:
Small organic molecule
Emp. Form.:
C3H5KOS2
Mol. Mass.:
160.299
SMILES:
[K+].CCOC([S-])=S
: