Target
Carbonic anhydrase 12
Ligand
BDBM50004945
Substrate
Meas. Tech.
ChEMBL_959998 (CHEMBL2384051)
Ki
750±n/a nM
Citation
 Carta, FAkdemir, AScozzafava, AMasini, ESupuran, CT Xanthates and trithiocarbonates strongly inhibit carbonic anhydrases and show antiglaucoma effects in vivo. J Med Chem 56:4691-700 (2013)  
Target
Name:
Carbonic anhydrase 12
Synonyms:
CA-XII CAH12_HUMAN Carbonic anhydrase Carbonic anhydrase XII Carbonic anhydrase XII (CAXII) | Tumor antigen HOM-RCC-3.1.3
Type:
Enzyme
Mol. Mass.:
39456.00
Organism:
Homo sapiens (Human)
Description:
Catalytic domain of human cloned isozyme was used in the assay
Residue:
354
  
Inhibitor
Name:
BDBM50004945
Synonyms:
CHEMBL2380752
Type:
Small organic molecule
Emp. Form.:
C12H17KOS2
Mol. Mass.:
280.491
SMILES:
[K+].[S-]C(=S)OCC12CC3CC(CC(C3)C1)C2
: