Target
Carbonic anhydrase 9
Ligand
BDBM50004944
Substrate
Meas. Tech.
ChEMBL_959999 (CHEMBL2384052)
Ki
779±n/a nM
Citation
 Carta, FAkdemir, AScozzafava, AMasini, ESupuran, CT Xanthates and trithiocarbonates strongly inhibit carbonic anhydrases and show antiglaucoma effects in vivo. J Med Chem 56:4691-700 (2013)  
Target
Name:
Carbonic anhydrase 9
Synonyms:
CA-IX CAH9_HUMAN Carbonic anhydrase 9 (CA IX) Carbonic anhydrase 9 precursor Carbonic anhydrase IX (CAIX) Carbonic anhydrases; II & IX MN RCC-associated antigen G250
Type:
Enzyme
Mol. Mass.:
49669.03
Organism:
Homo sapiens (Human)
Description:
Catalytic domain of human cloned isozyme was used in the assay
Residue:
459
  
Inhibitor
Name:
BDBM50004944
Synonyms:
CHEMBL2380753
Type:
Small organic molecule
Emp. Form.:
C13H19KOS2
Mol. Mass.:
294.518
SMILES:
[K+].[S-]C(=S)OCCC12CC3CC(CC(C3)C1)C2
: