Target
Prothrombin
Ligand
BDBM50442881
Substrate
Meas. Tech.
ChEMBL_982099 (CHEMBL2428686)
Kd
1.9±n/a nM
Citation
 Bijak, MZiewiecki, RSaluk, JPonczek, MPawlaczyk, IKrotkiewski, HWachowicz, BNowak, P Thrombin inhibitory activity of some polyphenolic compounds. Med Chem Res 23:2324-2337 (2014)  
Target
Name:
Prothrombin
Synonyms:
Activation peptide fragment 1 Coagulation factor II Prothrombin precursor Thrombin heavy chain | Thrombin light chain
Type:
Protein
Mol. Mass.:
70029.57
Organism:
Homo sapiens (Human)
Description:
P00734
Residue:
622
  
Inhibitor
Name:
BDBM50442881
Synonyms:
SILYBIN A
Type:
Small organic molecule
Emp. Form.:
C25H22O10
Mol. Mass.:
482.4362
SMILES:
COc1cc(ccc1O)[C@H]1Oc2cc(ccc2O[C@@H]1CO)[C@H]1Oc2cc(O)cc(O)c2C(O)C1=O
: