Target
Vascular endothelial growth factor receptor 2
Ligand
BDBM5875
Substrate
Meas. Tech.
ChEMBL_1287748 (CHEMBL3111580)
IC50
17±n/a nM
Citation
 Lintnerová, LGarcía-Caballero, MGregán, FMelichercík, MQuesada, ARDobia?, JLác, JSali?ová, MBohác, A A development of chimeric VEGFR2 TK inhibitor based on two ligand conformers from PDB: 1Y6A complex--medicinal chemistry consequences of a TKs analysis. Eur J Med Chem 72:146-59 (2014)  
Target
Name:
Vascular endothelial growth factor receptor 2
Synonyms:
CD_antigen=CD309 Fetal liver kinase 1 (FLK-1) KDR Protein-tyrosine kinase receptor Flk-1 VEGFR-2 VEGFR2 Vascular Endothelial Growth Factor Receptor Kinase 2 Vascular endothelial growth factor receptor 2 (KDR) Vascular endothelial growth factor receptor 2 (VEGFR2) Vascular endothelial growth factor receptor-2 (VEGFR-2)
Type:
Receptor Tyrosine Kinase
Mol. Mass.:
151510.97
Organism:
Homo sapiens (Human)
Description:
P35968
Residue:
1356
  
Inhibitor
Name:
BDBM5875
Synonyms:
2-Anilino-5-aryloxazole 39 N-[5-(ethanesulfonyl)-2-methoxyphenyl]-5-[3-(pyridin-2-yl)phenyl]-1,3-oxazol-2-amine
Type:
Small organic molecule
Emp. Form.:
C23H21N3O4S
Mol. Mass.:
435.496
SMILES:
CCS(=O)(=O)c1ccc(OC)c(Nc2ncc(o2)-c2cccc(c2)-c2ccccn2)c1
: