Target
Vascular endothelial growth factor receptor 2
Ligand
BDBM50005212
Substrate
Meas. Tech.
ChEMBL_1287748 (CHEMBL3111580)
IC50
51±n/a nM
Citation
 Lintnerová, LGarcía-Caballero, MGregán, FMelichercík, MQuesada, ARDobia?, JLác, JSali?ová, MBohác, A A development of chimeric VEGFR2 TK inhibitor based on two ligand conformers from PDB: 1Y6A complex--medicinal chemistry consequences of a TKs analysis. Eur J Med Chem 72:146-59 (2014)  
Target
Name:
Vascular endothelial growth factor receptor 2
Synonyms:
CD_antigen=CD309 Fetal liver kinase 1 (FLK-1) KDR Protein-tyrosine kinase receptor Flk-1 VEGFR-2 VEGFR2 Vascular Endothelial Growth Factor Receptor Kinase 2 Vascular endothelial growth factor receptor 2 (KDR) Vascular endothelial growth factor receptor 2 (VEGFR2) Vascular endothelial growth factor receptor-2 (VEGFR-2)
Type:
Receptor Tyrosine Kinase
Mol. Mass.:
151510.97
Organism:
Homo sapiens (Human)
Description:
P35968
Residue:
1356
  
Inhibitor
Name:
BDBM50005212
Synonyms:
CHEMBL3109275
Type:
Small organic molecule
Emp. Form.:
C28H24N4O4S
Mol. Mass.:
512.58
SMILES:
CCS(=O)(=O)c1ccc(OC)c(Nc2ncc(o2)-c2cc(cc(c2)-c2ccccn2)-c2cccnc2)c1
: