Target
Translocator protein
Ligand
BDBM50005295
Substrate
Meas. Tech.
ChEMBL_1295421 (CHEMBL3131058)
Ki
0.54±n/a nM
Citation
 Médran-Navarrete, VDamont, APeyronneau, MAKuhnast, BBernards, NPottier, GMarguet, FPuech, FBoisgard, RDollé, F Preparation and evaluation of novel pyrazolo[1,5-a]pyrimidine acetamides, closely related to DPA-714, as potent ligands for imaging the TSPO 18kDa with PET. Bioorg Med Chem Lett 24:1550-6 (2014)  
Target
Name:
Translocator protein
Synonyms:
Benzodiazepine receptors; peripheral & central Mbr PBR Peripheral benzodiazepine receptor (PBR) TSPO_RAT | Tspo
Type:
Mitochondrion membrane protein
Mol. Mass.:
18945.84
Organism:
Rattus norvegicus (rat)
Description:
Competitive binding experiments were performed on rat kidney mitochondrial membranes.
Residue:
169
  
Inhibitor
Name:
BDBM50005295
Synonyms:
CHEMBL3125361
Type:
Small organic molecule
Emp. Form.:
C23H25FN4O
Mol. Mass.:
392.4692
SMILES:
CCN(CC)C(=O)Cc1c(nn2c(C)cc(C)nc12)-c1ccc(cc1)C#CCF
: