Target
Indolethylamine N-methyltransferase
Ligand
BDBM50000095
Substrate
Meas. Tech.
ChEMBL_1333667 (CHEMBL3231053)
IC50
13800±n/a nM
Citation
 Rokach, JHamel, PHunter, NRReader, GRooney, CSAnderson, PSCragoe, EJMandel, LR Cyclic amidine inhibitors of indolamine N-methyltransferase. J Med Chem 22:237-47 (1979)  
Target
Name:
Indolethylamine N-methyltransferase
Synonyms:
Amine N-methyltransferase Arylamine N-methyltransferase INMT_RABIT Thioether S-methyltransferase
Type:
PROTEIN
Mol. Mass.:
28949.17
Organism:
Oryctolagus cuniculus
Description:
ChEMBL_108264
Residue:
263
  
Inhibitor
Name:
BDBM50000095
Synonyms:
CHEMBL3228344
Type:
Small organic molecule
Emp. Form.:
C10H14N2O5
Mol. Mass.:
242.2286
SMILES:
OC(=O)\C=C\C(O)=O.C1CN2CCOCC2=N1
: