Target
Indolethylamine N-methyltransferase
Ligand
BDBM50000331
Substrate
Meas. Tech.
ChEMBL_1333668 (CHEMBL3231054)
IC50
24500±n/a nM
Citation
 Rokach, JHamel, PHunter, NRReader, GRooney, CSAnderson, PSCragoe, EJMandel, LR Cyclic amidine inhibitors of indolamine N-methyltransferase. J Med Chem 22:237-47 (1979)  
Target
Name:
Indolethylamine N-methyltransferase
Synonyms:
Amine N-methyltransferase Arylamine N-methyltransferase INMT_HUMAN | Indolamine N-methyltransferase
Type:
PROTEIN
Mol. Mass.:
28884.19
Organism:
Homo sapiens (Human)
Description:
ChEMBL_1333668
Residue:
263
  
Inhibitor
Name:
BDBM50000331
Synonyms:
CHEMBL3228350
Type:
Small organic molecule
Emp. Form.:
C8H10N2O4S
Mol. Mass.:
230.241
SMILES:
OC(=O)C(O)=O.C1CN2C=CCSC2=N1
: