Target
Glutamate receptor ionotropic, NMDA 1/2A
Ligand
BDBM50001000
Substrate
Meas. Tech.
ChEMBL_1337624 (CHEMBL3242673)
pH
7.6±n/a
IC50
1300±n/a nM
Comments
extracted
Citation
 Huang, TLMayence, AVanden Eynde, JJ Some non-conventional biomolecular targets for diamidines. A short survey. Bioorg Med Chem 22:1983-92 (2014)  
Target
Name:
Glutamate receptor ionotropic, NMDA 1/2A
Synonyms:
Glutamate NMDA receptor; GRIN1/GRIN2A NR1/NR2A
Type:
Protein
Mol. Mass.:
Description:
Components:
This complex has 2 components.
Component 1
Name:
Glutamate receptor ionotropic, NMDA 1
Synonyms:
GRIN1 Glutamate [NMDA] receptor subunit zeta-1 N-methyl-D-aspartate receptor subunit NR1 NMDZ1_HUMAN | phencyclidine
Type:
Enzyme Catalytic Domain
Mol. Mass.:
105397.81
Organism:
Homo sapiens (Human)
Description:
Q05586
Residue:
938
  
Component 2
Name:
Glutamate receptor ionotropic, NMDA 2A
Synonyms:
GRIN2A Glutamate [NMDA] receptor Glutamate [NMDA] receptor subunit epsilon-1 NMDA receptor subtype 2A protein (NR2A) NMDE1_HUMAN hNR2A
Type:
Mol. Mass.:
165293.76
Organism:
Homo sapiens (Human)
Description:
Residue:
1464
  
Inhibitor
Name:
BDBM50001000
Synonyms:
CHEBI:29133 US11535596, Compound Dextorphan (DX)
Type:
Small organic molecule
Emp. Form.:
C17H23NO
Mol. Mass.:
257.3706
SMILES:
[H][C@]12Cc3ccc(O)cc3[C@@]3(CCCC[C@]13[H])CCN2C
: