Target
DNA polymerase alpha catalytic subunit
Ligand
BDBM50001208
Substrate
Meas. Tech.
ChEMBL_1338517 (CHEMBL3241263)
EC50
70000±n/a nM
Citation
 Baraniak, JPietkiewicz, AKaczmarek, RRadzikowska, EKulik, KKrolewska, KCieslak, MKrakowiak, ANawrot, B N-Acyl-phosphoramidates as potential novel form of gemcitabine prodrugs. Bioorg Med Chem 22:2133-40 (2014)  
Target
Name:
DNA polymerase alpha catalytic subunit
Synonyms:
DNA polymerase (alpha/delta/epsilon) DPOLA_HUMAN POLA1
Type:
PROTEIN
Mol. Mass.:
165895.25
Organism:
Homo sapiens (Human)
Description:
ChEMBL_1365493
Residue:
1462
  
Inhibitor
Name:
BDBM50001208
Synonyms:
CHEMBL3236424
Type:
Small organic molecule
Emp. Form.:
C11H15F2N4O7P
Mol. Mass.:
384.23
SMILES:
CC(=O)NP(O)(=O)OC[C@H]1O[C@@H](n2ccc(N)nc2=O)C(F)(F)[C@@H]1O
: