Target
Prostaglandin G/H synthase 1
Ligand
BDBM50001252
Substrate
Meas. Tech.
ChEMBL_1339751 (CHEMBL3243388)
IC50
45900±n/a nM
Citation
 Abdel-Aziz, MBeshr, EAAbdel-Rahman, IMOzadali, KTan, OUAly, OM 1-(4-Methoxyphenyl)-5-(3,4,5-trimethoxyphenyl)-1H-1,2,4-triazole-3-carboxamides: synthesis, molecular modeling, evaluation of their anti-inflammatory activity and ulcerogenicity. Eur J Med Chem 77:155-65 (2014)  
Target
Name:
Prostaglandin G/H synthase 1
Synonyms:
COX1 Cyclooxygenase-1 (COX-1) PTGS1 | Prostaglandin G/H synthase (cyclooxygenase)
Type:
Protein
Mol. Mass.:
68868.60
Organism:
Ovis aries (Sheep)
Description:
Residue:
600
  
Inhibitor
Name:
BDBM50001252
Synonyms:
CHEMBL3236777
Type:
Small organic molecule
Emp. Form.:
C20H22N4O5
Mol. Mass.:
398.4125
SMILES:
CNC(=O)c1nc(-c2cc(OC)c(OC)c(OC)c2)n(n1)-c1ccc(OC)cc1
: