Target
Receptor-type tyrosine-protein kinase FLT3
Ligand
BDBM50001537
Substrate
Meas. Tech.
ChEMBL_1336033 (CHEMBL3240326)
IC50
2.0±n/a nM
Citation
 Li, ZWang, XEksterowicz, JGribble, MWAlba, GQAyres, MCarlson, TJChen, AChen, XCho, RConnors, RVDeGraffenreid, MDeignan, JTDuquette, JFan, PFisher, BFu, JHuard, JNKaizerman, JKeegan, KSLi, CLi, KLi, YLiang, LLiu, WLively, SELo, MCMa, JMcMinn, DLMihalic, JTModi, KNgo, RPattabiraman, KPiper, DEQueva, CRagains, MLSuchomel, JThibault, SWalker, NWang, XWang, ZWanska, MWehn, PMWeidner, MFZhang, AJZhao, XKamb, AWickramasinghe, DDai, KMcGee, LRMedina, JC Discovery of AMG 925, a FLT3 and CDK4 dual kinase inhibitor with preferential affinity for the activated state of FLT3. J Med Chem 57:3430-49 (2014)  
Target
Name:
Receptor-type tyrosine-protein kinase FLT3
Synonyms:
CD135 FL cytokine receptor FLK2 FLT3 Fetal liver kinase-2 Fms-like tyrosine kinase 3 (Flt-3) STK-1 Stem cell tyrosine kinase 1
Type:
Enzyme
Mol. Mass.:
112888.62
Organism:
Homo sapiens (Human)
Description:
P36888
Residue:
993
  
Inhibitor
Name:
BDBM50001537
Synonyms:
CHEMBL3237702 | US8841312, 55
Type:
Small organic molecule
Emp. Form.:
C25H30N8
Mol. Mass.:
442.5593
SMILES:
CC1CCC(CC1)n1c2cnccc2c2cnc(Nc3ccc(cn3)N3CCNCC3)nc12
: