Target
Cyclin-dependent kinase 4
Ligand
BDBM50001545
Substrate
Meas. Tech.
ChEMBL_1336449 (CHEMBL3242593)
IC50
23±n/a nM
Citation
 Li, ZWang, XEksterowicz, JGribble, MWAlba, GQAyres, MCarlson, TJChen, AChen, XCho, RConnors, RVDeGraffenreid, MDeignan, JTDuquette, JFan, PFisher, BFu, JHuard, JNKaizerman, JKeegan, KSLi, CLi, KLi, YLiang, LLiu, WLively, SELo, MCMa, JMcMinn, DLMihalic, JTModi, KNgo, RPattabiraman, KPiper, DEQueva, CRagains, MLSuchomel, JThibault, SWalker, NWang, XWang, ZWanska, MWehn, PMWeidner, MFZhang, AJZhao, XKamb, AWickramasinghe, DDai, KMcGee, LRMedina, JC Discovery of AMG 925, a FLT3 and CDK4 dual kinase inhibitor with preferential affinity for the activated state of FLT3. J Med Chem 57:3430-49 (2014)  
Target
Name:
Cyclin-dependent kinase 4
Synonyms:
CDK4 Cell division protein kinase 4 PSK-J3
Type:
Enzyme Subunit
Mol. Mass.:
33731.96
Organism:
Homo sapiens (Human)
Description:
P11802
Residue:
303
  
Inhibitor
Name:
BDBM50001545
Synonyms:
CHEMBL3237710
Type:
Small organic molecule
Emp. Form.:
C27H35N9
Mol. Mass.:
485.6271
SMILES:
C[C@H]1CC[C@@H](CC1)n1c2cnccc2c2cnc(Nc3ccc(nn3)N3CCC(CC3)N(C)C)nc12
: