Target
Cathepsin B
Ligand
BDBM50001681
Substrate
Meas. Tech.
ChEMBL_1337273 (CHEMBL3240887)
Ki
869±n/a nM
Citation
 Raghav, NSingh, M Acyl hydrazides and triazoles as novel inhibitors of mammalian cathepsin B and cathepsin H. Eur J Med Chem 77:231-42 (2014)  
Target
Name:
Cathepsin B
Synonyms:
Type:
Protein
Mol. Mass.:
36777.57
Organism:
Capra hircus (Goat)
Description:
Residue:
335
  
Inhibitor
Name:
BDBM50001681
Synonyms:
CHEMBL339003 | Phenyl-Acetic Acid Hydrazide
Type:
Small organic molecule
Emp. Form.:
C8H10N2O
Mol. Mass.:
150.1778
SMILES:
NNC(=O)Cc1ccccc1
: