Target
Neuronal acetylcholine receptor subunit alpha-3/beta-2
Ligand
BDBM50001702
Substrate
Meas. Tech.
ChEMBL_1337304 (CHEMBL3241028)
IC50
>10000±n/a nM
Citation
 Chang, YPBanerjee, JDowell, CWu, JGyanda, RHoughten, RAToll, LMcIntosh, JMArmishaw, CJ Discovery of a potent and selectivea3ß4 nicotinic acetylcholine receptor antagonist from ana-conotoxin synthetic combinatorial library. J Med Chem 57:3511-21 (2014)  
Target
Name:
Neuronal acetylcholine receptor subunit alpha-3/beta-2
Synonyms:
Neuronal acetylcholine receptor Alpha-3/Beta-2 Neuronal acetylcholine receptor; alpha3/beta2 | nAChR subtypes alpha3 beta2
Type:
Protein
Mol. Mass.:
Description:
Components:
This complex has 2 components.
Component 1
Name:
Neuronal acetylcholine receptor subunit alpha-3
Synonyms:
ACHA3_RAT Chrna3
Type:
Enzyme
Mol. Mass.:
56995.52
Organism:
Rattus norvegicus (Rat)
Description:
P04757
Residue:
499
  
Component 2
Name:
Neuronal acetylcholine receptor subunit beta-2
Synonyms:
ACHB2_RAT Chrnb2 Neuronal acetylcholine receptor non-alpha-1 chain
Type:
Enzyme
Mol. Mass.:
56910.32
Organism:
Rattus norvegicus (Rat)
Description:
P12390
Residue:
500
  
Inhibitor
Name:
BDBM50001702
Synonyms:
CHEMBL3238084
Type:
Small organic molecule
Emp. Form.:
C60H85N13O16S4
Mol. Mass.:
1372.654
SMILES:
[H][C@@]12CCCN1C(=O)[C@]1([H])CCCN1C(=O)[C@H](CCCC)NC(=O)[C@H](CO)NC(=O)[C@]1([H])CSSC[C@H](NC(=O)[C@H](Cc3ccc(O)cc3)NC(=O)[C@H](CCC)NC(=O)[C@H](CC)NC(=O)[C@H](Cc3ccccc3)NC(=O)[C@]([H])(CSSC[C@H](NC(=O)CN)C(=O)N1)NC2=O)C(O)=O
: