Target
Histamine H1 receptor
Ligand
BDBM50001751
Substrate
Meas. Tech.
ChEMBL_1338137 (CHEMBL3242004)
Ki
29512±n/a nM
Citation
 Sadek, BSchwed, JSSubramanian, DWeizel, LWalter, MAdem, AStark, H Non-imidazole histamine H3 receptor ligands incorporating antiepileptic moieties. Eur J Med Chem 77:269-79 (2014)  
Target
Name:
Histamine H1 receptor
Synonyms:
H1R HISTAMINE H1 HRH1_HUMAN
Type:
G Protein-Coupled Receptor (GPCR)
Mol. Mass.:
55808.72
Organism:
Homo sapiens (Human)
Description:
Cell pellets from SK-N-MC cells transfected with human H1 receptor were used in binding assay.
Residue:
487
  
Inhibitor
Name:
BDBM50001751
Synonyms:
CHEMBL3238444
Type:
Small organic molecule
Emp. Form.:
C18H26N4O
Mol. Mass.:
314.4252
SMILES:
Cc1nnc(C)n1-c1ccc(OCCCN2CCCCC2)cc1
: