Target
Histamine H1 receptor
Ligand
BDBM50001756
Substrate
Meas. Tech.
ChEMBL_1338137 (CHEMBL3242004)
Ki
2239±n/a nM
Citation
 Sadek, BSchwed, JSSubramanian, DWeizel, LWalter, MAdem, AStark, H Non-imidazole histamine H3 receptor ligands incorporating antiepileptic moieties. Eur J Med Chem 77:269-79 (2014)  
Target
Name:
Histamine H1 receptor
Synonyms:
H1R HISTAMINE H1 HRH1_HUMAN
Type:
G Protein-Coupled Receptor (GPCR)
Mol. Mass.:
55808.72
Organism:
Homo sapiens (Human)
Description:
Cell pellets from SK-N-MC cells transfected with human H1 receptor were used in binding assay.
Residue:
487
  
Inhibitor
Name:
BDBM50001756
Synonyms:
CHEMBL3238447
Type:
Small organic molecule
Emp. Form.:
C30H33N3O3
Mol. Mass.:
483.6013
SMILES:
O=C1NC(C(=O)N1Cc1ccc(OCCCN2CCCCC2)cc1)(c1ccccc1)c1ccccc1
: