Target
Bifunctional epoxide hydrolase 2
Ligand
BDBM50002341
Substrate
Meas. Tech.
ChEMBL_1338955 (CHEMBL3240515)
IC50
49000±n/a nM
Citation
 Amano, YYamaguchi, TTanabe, E Structural insights into binding of inhibitors to soluble epoxide hydrolase gained by fragment screening and X-ray crystallography. Bioorg Med Chem 22:2427-34 (2014)  
Target
Name:
Bifunctional epoxide hydrolase 2
Synonyms:
Cytosolic epoxide hydrolase 2 EPHX2 HYES_HUMAN Soluble epoxide hydrolase (sEH) | epoxide hydrolase 2, cytoplasmic
Type:
Enzyme
Mol. Mass.:
62613.07
Organism:
Homo sapiens (Human)
Description:
P34913
Residue:
555
  
Inhibitor
Name:
BDBM50002341
Synonyms:
CHEMBL442384
Type:
Small organic molecule
Emp. Form.:
C8H5F3N2S
Mol. Mass.:
218.199
SMILES:
Nc1nc2ccc(cc2s1)C(F)(F)F
: