Target
Vascular endothelial growth factor A
Ligand
BDBM50002918
Substrate
Meas. Tech.
ChEMBL_1339790 (CHEMBL3243495)
IC50
0.320000±n/a nM
Citation
 Chen, QYLiu, YCai, WLuesch, H Improved total synthesis and biological evaluation of potent apratoxin S4 based anticancer agents with differential stability and further enhanced activity. J Med Chem 57:3011-29 (2014)  
Target
Name:
Vascular endothelial growth factor A
Synonyms:
VEGF VEGFA VPF Vascular endothelial growth factor A (VEGF) Vascular permeability factor
Type:
Protein
Mol. Mass.:
27063.81
Organism:
Homo sapiens (Human)
Description:
P15692
Residue:
232
  
Inhibitor
Name:
BDBM50002918
Synonyms:
Apratoxin S4
Type:
Small organic molecule
Emp. Form.:
C44H69N5O8S
Mol. Mass.:
828.112
SMILES:
[H][C@]12CSC(=N1)[C@@H](C)[C@@H](O)C[C@H](C)C[C@H](OC(=O)[C@]1([H])CCCN1C(=O)[C@]([H])([C@@H](C)CC)N(C)C(=O)[C@H](C)N(C)C(=O)[C@H](Cc1ccc(OC)cc1)NC(=O)CC2)C(C)(C)C
: