Target
Dipeptidyl peptidase 9
Ligand
BDBM50003020
Substrate
Meas. Tech.
ChEMBL_1335103 (CHEMBL3239610)
IC50
>67000±n/a nM
Citation
 Biftu, TSinha-Roy, RChen, PQian, XFeng, DKuethe, JTScapin, GGao, YDYan, YKrueger, DBak, AEiermann, GHe, JCox, JHicks, JLyons, KHe, HSalituro, GTong, SPatel, SDoss, GPetrov, AWu, JXu, SSSewall, CZhang, XZhang, BThornberry, NAWeber, AE Omarigliptin (MK-3102): a novel long-acting DPP-4 inhibitor for once-weekly treatment of type 2 diabetes. J Med Chem 57:3205-12 (2014)  
Target
Name:
Dipeptidyl peptidase 9
Synonyms:
DPP9 DPRP-2 Dipeptidyl peptidase 9 (DDP9) Dipeptidyl peptidase 9 (DPP9) Dipeptidyl peptidase IX Dipeptidyl peptidase-like protein 9
Type:
Enzyme
Mol. Mass.:
98260.70
Organism:
Homo sapiens (Human)
Description:
Q86TI2
Residue:
863
  
Inhibitor
Name:
BDBM50003020
Synonyms:
MK-3102 US10155775, Omarigliptin US10822319, Compound Omarigliptin
Type:
Small organic molecule
Emp. Form.:
C17H20F2N4O3S
Mol. Mass.:
398.428
SMILES:
CS(=O)(=O)n1cc2CN(Cc2n1)[C@H]1CO[C@@H]([C@@H](N)C1)c1cc(F)ccc1F
: