Target
D(2) dopamine receptor
Ligand
BDBM50003065
Substrate
Meas. Tech.
ChEMBL_1335160 (CHEMBL3239709)
Ki
190±n/a nM
Citation
 Xiao, JFree, RBBarnaeva, EConroy, JLDoyle, TMiller, BBryant-Genevier, MTaylor, MKHu, XDulcey, AESouthall, NFerrer, MTitus, SZheng, WSibley, DRMarugan, JJ Discovery, optimization, and characterization of novel D2 dopamine receptor selective antagonists. J Med Chem 57:3450-63 (2014)  
Target
Name:
D(2) dopamine receptor
Synonyms:
D(2) dopamine receptor DOPAMINE D2 Long DRD2 Dopamine D2 receptor Dopamine D2 receptor (D2R) Dopamine2-like | d2
Type:
Cell-surface receptors
Mol. Mass.:
50647.10
Organism:
Homo sapiens (Human)
Description:
P14416
Residue:
443
  
Inhibitor
Name:
BDBM50003065
Synonyms:
CHEMBL3234522
Type:
Small organic molecule
Emp. Form.:
C21H18N2O3S2
Mol. Mass.:
410.509
SMILES:
CN1c2cc(ccc2[S+]([O-])c2ccccc2C1=O)C(=O)NCCc1cccs1
: