Target
G-protein coupled bile acid receptor 1
Ligand
BDBM50003573
Substrate
Meas. Tech.
ChEMBL_1335572 (CHEMBL3239427)
IC50
215±n/a nM
Citation
 Phillips, DPGao, WYang, YZhang, GLerario, IKLau, TLJiang, JWang, XNguyen, DGBhat, BGTrotter, CSullivan, HWelzel, GLandry, JChen, YJoseph, SBLi, CGordon, WPRichmond, WJohnson, KBretz, ABursulaya, BPan, SMcNamara, PSeidel, HM Discovery of trifluoromethyl(pyrimidin-2-yl)azetidine-2-carboxamides as potent, orally bioavailable TGR5 (GPBAR1) agonists: structure-activity relationships, lead optimization, and chronic in vivo efficacy. J Med Chem 57:3263-82 (2014)  
Target
Name:
G-protein coupled bile acid receptor 1
Synonyms:
BG37 GPBAR_HUMAN TGR5 hGPCR19
Type:
G Protein-Coupled Receptor (GPCR)
Mol. Mass.:
35260.02
Organism:
Homo sapiens (Human)
Description:
CHO cells transiently transfected with hTGR5.
Residue:
330
  
Inhibitor
Name:
BDBM50003573
Synonyms:
CHEMBL3234871
Type:
Small organic molecule
Emp. Form.:
C31H30F3N5O3
Mol. Mass.:
577.5968
SMILES:
OC(=O)[C@H]1CC[C@@H](CC1)c1ccc(cc1)-c1cc(nc(n1)C(F)(F)F)N1CC[C@H]1C(=O)NCCc1ccc(cc1)C#N
: