Target
Heat shock protein 75 kDa, mitochondrial
Ligand
BDBM50003908
Substrate
Meas. Tech.
ChEMBL_1336951 (CHEMBL3242259)
Ki
>10000±n/a nM
Citation
 Ernst, JTNeubert, TLiu, MSperry, SZuccola, HTurnbull, AFleck, BKargo, WWoody, LChiang, PTran, DChen, WSnyder, PAlcacio, TNezami, AReynolds, JAlvi, KGoulet, LStamos, D Identification of novel HSP90a/ß isoform selective inhibitors using structure-based drug design. demonstration of potential utility in treating CNS disorders such as Huntington's disease. J Med Chem 57:3382-400 (2014)  
Target
Name:
Heat shock protein 75 kDa, mitochondrial
Synonyms:
HSP75 TRAP1_HUMAN
Type:
PROTEIN
Mol. Mass.:
80120.13
Organism:
Homo sapiens (Human)
Description:
ChEMBL_1478164
Residue:
704
  
Inhibitor
Name:
BDBM50003908
Synonyms:
CHEMBL3235330
Type:
Small organic molecule
Emp. Form.:
C21H25N3O2
Mol. Mass.:
351.4421
SMILES:
CN1CCc2c(C1)n(c1CC(C)(C)CC(=O)c21)-c1ccc(cc1)C(N)=O
: