Target
Intestinal-type alkaline phosphatase
Ligand
BDBM50004306
Substrate
Meas. Tech.
ChEMBL_1335196 (CHEMBL3239865)
IC50
920±n/a nM
Citation
 Khan, IZaib, SIbrar, ARama, NHSimpson, JIqbal, J Synthesis, crystal structure and biological evaluation of some novel 1,2,4-triazolo[3,4-b]-1,3,4-thiadiazoles and 1,2,4-triazolo[3,4-b]-1,3,4-thiadiazines. Eur J Med Chem 78:167-77 (2014)  
Target
Name:
Intestinal-type alkaline phosphatase
Synonyms:
ALPI Intestinal alkaline phosphatase (IAP) PPBI_BOVIN
Type:
Protein
Mol. Mass.:
57094.82
Organism:
Bos taurus (Cattle)
Description:
P19111
Residue:
533
  
Inhibitor
Name:
BDBM50004306
Synonyms:
CHEMBL3237531
Type:
Small organic molecule
Emp. Form.:
C14H7ClFN5S
Mol. Mass.:
331.755
SMILES:
Fc1cc(Cl)ccc1-c1nn2c(nnc2s1)-c1ccncc1
: