Target
Rho-associated protein kinase 2
Ligand
BDBM50004419
Substrate
Meas. Tech.
ChEMBL_1336571 (CHEMBL3240142)
IC50
68±n/a nM
Citation
 Chen, HHNamil, ASeverns, BWard, JKelly, CDrace, CMcLaughlin, MAYacoub, SLi, BPatil, RSharif, NHellberg, MRRusinko, APang, IHCombrink, KD In vivo optimization of 2,3-diaminopyrazine Rho Kinase inhibitors for the treatment of glaucoma. Bioorg Med Chem Lett 24:1875-9 (2014)  
Target
Name:
Rho-associated protein kinase 2
Synonyms:
KIAA0619 ROCK2 Rho kinase 2 (ROCKII) Rho-associated protein kinase 2 (ROCK2) Rho-associated protein kinase 2/Transforming protein RhoA Rho-associated, coiled-coil-containing protein kinase II p164 ROCK-2
Type:
Protein
Mol. Mass.:
160885.43
Organism:
Homo sapiens (Human)
Description:
O75116
Residue:
1388
  
Inhibitor
Name:
BDBM50004419
Synonyms:
CHEMBL3238164
Type:
Small organic molecule
Emp. Form.:
C22H31N7O2
Mol. Mass.:
425.5272
SMILES:
CC(=O)NCC(O)CN1CCN(CC1)c1nc(cnc1N1CCCC1)-c1ccncc1
: