Target
Rho-associated protein kinase 2
Ligand
BDBM50004422
Substrate
Meas. Tech.
ChEMBL_1336573 (CHEMBL3240144)
EC50
260±n/a nM
Citation
 Chen, HHNamil, ASeverns, BWard, JKelly, CDrace, CMcLaughlin, MAYacoub, SLi, BPatil, RSharif, NHellberg, MRRusinko, APang, IHCombrink, KD In vivo optimization of 2,3-diaminopyrazine Rho Kinase inhibitors for the treatment of glaucoma. Bioorg Med Chem Lett 24:1875-9 (2014)  
Target
Name:
Rho-associated protein kinase 2
Synonyms:
KIAA0619 ROCK2 Rho kinase 2 (ROCKII) Rho-associated protein kinase 2 (ROCK2) Rho-associated protein kinase 2/Transforming protein RhoA Rho-associated, coiled-coil-containing protein kinase II p164 ROCK-2
Type:
Protein
Mol. Mass.:
160885.43
Organism:
Homo sapiens (Human)
Description:
O75116
Residue:
1388
  
Inhibitor
Name:
BDBM50004422
Synonyms:
CHEMBL3238167
Type:
Small organic molecule
Emp. Form.:
C16H18N6
Mol. Mass.:
294.3543
SMILES:
C1CNCCN(C1)c1cncc(n1)-c1ccc2[nH]ncc2c1
: