Target
Polyunsaturated fatty acid 5-lipoxygenase
Ligand
BDBM50004429
Substrate
Meas. Tech.
ChEMBL_1336618 (CHEMBL3240356)
IC50
34±n/a nM
Citation
 Shang, ELiu, YWu, YZhu, WHe, CLai, L Development of 3,5-dinitrobenzoate-based 5-lipoxygenase inhibitors. Bioorg Med Chem 22:2396-402 (2014)  
Target
Name:
Polyunsaturated fatty acid 5-lipoxygenase
Synonyms:
5-LO 5-Lipoxygenase (5-LO) 5-Lipoygenase ALOX5 LOG5 | LOX5_HUMAN
Type:
Enzyme
Mol. Mass.:
77972.74
Organism:
Homo sapiens (Human)
Description:
Recombinant protein was purified from E. coli lysate. After ammonium sulfate precipitation and subsequent steps, the supernatant (S100) was used for 5-LO activity assay.
Residue:
674
  
Inhibitor
Name:
BDBM50004429
Synonyms:
CHEMBL3238468
Type:
Small organic molecule
Emp. Form.:
C14H11N3O6
Mol. Mass.:
317.2536
SMILES:
COc1ccc(NC(=O)c2cc(cc(c2)[N+]([O-])=O)[N+]([O-])=O)cc1
: