Target
Carbonic anhydrase 9
Ligand
BDBM50004511
Substrate
Meas. Tech.
ChEMBL_1337409 (CHEMBL3241554)
Ki
341±n/a nM
Citation
 Moeker, JPeat, TSBornaghi, LFVullo, DSupuran, CTPoulsen, SA Cyclic secondary sulfonamides: unusually good inhibitors of cancer-related carbonic anhydrase enzymes. J Med Chem 57:3522-31 (2014)  
Target
Name:
Carbonic anhydrase 9
Synonyms:
CA-IX CAH9_HUMAN Carbonic anhydrase 9 (CA IX) Carbonic anhydrase 9 precursor Carbonic anhydrase IX (CAIX) Carbonic anhydrases; II & IX MN RCC-associated antigen G250
Type:
Enzyme
Mol. Mass.:
49669.03
Organism:
Homo sapiens (Human)
Description:
Catalytic domain of human cloned isozyme was used in the assay
Residue:
459
  
Inhibitor
Name:
BDBM50004511
Synonyms:
CHEMBL3233391
Type:
Small organic molecule
Emp. Form.:
C16H12N4O4S
Mol. Mass.:
356.356
SMILES:
COc1ccc(cc1)-c1cn(nn1)-c1ccc2C(=O)NS(=O)(=O)c2c1
: