Target
Nuclear receptor ROR-gamma
Ligand
BDBM50005528
Substrate
Meas. Tech.
ChEMBL_1338698 (CHEMBL3242036)
IC50
2440±n/a nM
Citation
 Zhang, YXue, XJin, XSong, YLi, JLuo, XSong, MYan, WSong, HXu, Y Discovery of 2-oxo-1,2-dihydrobenzo[cd]indole-6-sulfonamide derivatives as new ROR¿ inhibitors using virtual screening, synthesis and biological evaluation. Eur J Med Chem 78:431-41 (2014)  
Target
Name:
Nuclear receptor ROR-gamma
Synonyms:
NR1F3 Nuclear receptor ROR-gamma (RORC) RAR-related orphan receptor C (RORc) RORG RZRG Retinoid-related orphan receptor-gamma (RORc)
Type:
Enzyme Catalytic Domain
Mol. Mass.:
58218.40
Organism:
Homo sapiens (Human)
Description:
P51449
Residue:
518
  
Inhibitor
Name:
BDBM50005528
Synonyms:
CHEMBL3234271 | CHEMBL344406
Type:
Small organic molecule
Emp. Form.:
C21H17F3N4O6S2
Mol. Mass.:
542.508
SMILES:
NS(=O)(=O)c1ccc(cc1)N1NC(\C(=C/c2ccc(o2)-c2ccc(cc2)S(N)(=O)=O)C1=O)C(F)(F)F
: