Target
Sigma non-opioid intracellular receptor 1
Ligand
BDBM50005671
Substrate
Meas. Tech.
ChEMBL_1335232 (CHEMBL3238585)
Ki
1.8±n/a nM
Citation
 Lan, YChen, YXu, XQiu, YLiu, SLiu, XLiu, BFZhang, G Synthesis and biological evaluation of a novel sigma-1 receptor antagonist based on 3,4-dihydro-2(1H)-quinolinone scaffold as a potential analgesic. Eur J Med Chem 79:216-30 (2014)  
Target
Name:
Sigma non-opioid intracellular receptor 1
Synonyms:
OPRS1 SIGMAR1 Sigma non-opioid intracellular receptor 1 Sigma1-receptor Sterol isomerase-like protein
Type:
Protein
Mol. Mass.:
25307.17
Organism:
Cavia porcellus (Guinea pig)
Description:
Q60492
Residue:
223
  
Inhibitor
Name:
BDBM50005671
Synonyms:
CHEMBL3235446
Type:
Small organic molecule
Emp. Form.:
C24H30N2O2
Mol. Mass.:
378.5072
SMILES:
O=C1CCc2ccc(OCCCN3CCCCC3)cc2N1Cc1ccccc1
: