Target
Neuronal acetylcholine receptor subunit beta-2
Ligand
BDBM50006631
Substrate
Meas. Tech.
ChEMBL_1335312 (CHEMBL3238809)
IC50
2900±n/a nM
Citation
 Crestey, FJensen, AABorch, MAndreasen, JTAndersen, JBalle, TKristensen, JL Design, synthesis, and biological evaluation of Erythrina alkaloid analogues as neuronal nicotinic acetylcholine receptor antagonists. J Med Chem 56:9673-82 (2014)  
Target
Name:
Neuronal acetylcholine receptor subunit beta-2
Synonyms:
ACHB2_MOUSE | Chrnb2
Type:
PROTEIN
Mol. Mass.:
57114.19
Organism:
Mus musculus
Description:
ChEMBL_108396
Residue:
501
  
Inhibitor
Name:
BDBM50006631
Synonyms:
CHEMBL3235507
Type:
Small organic molecule
Emp. Form.:
C17H23NO2
Mol. Mass.:
273.37
SMILES:
[H][C@]12CCN3CCc4cc(OC)c(O)cc4[C@]13CCCC2
: