Target
Neuronal acetylcholine receptor subunit beta-2
Ligand
BDBM50006645
Substrate
Meas. Tech.
ChEMBL_1335312 (CHEMBL3238809)
IC50
>300000±n/a nM
Citation
 Crestey, FJensen, AABorch, MAndreasen, JTAndersen, JBalle, TKristensen, JL Design, synthesis, and biological evaluation of Erythrina alkaloid analogues as neuronal nicotinic acetylcholine receptor antagonists. J Med Chem 56:9673-82 (2014)  
Target
Name:
Neuronal acetylcholine receptor subunit beta-2
Synonyms:
ACHB2_MOUSE | Chrnb2
Type:
PROTEIN
Mol. Mass.:
57114.19
Organism:
Mus musculus
Description:
ChEMBL_108396
Residue:
501
  
Inhibitor
Name:
BDBM50006645
Synonyms:
CHEMBL3235518
Type:
Small organic molecule
Emp. Form.:
C19H23NO3
Mol. Mass.:
313.3908
SMILES:
COc1cccc(c1)C1N(C)CCc2cc(OC)c(OC)cc12
: