Target
Histamine H4 receptor
Ligand
BDBM50006767
Substrate
Meas. Tech.
ChEMBL_1336216 (CHEMBL3241464)
Ki
8.0±n/a nM
Citation
 Savall, BMChavez, FTays, KDunford, PJCowden, JMHack, MDWolin, RLThurmond, RLEdwards, JP Discovery and SAR of 6-alkyl-2,4-diaminopyrimidines as histamine H4 receptor antagonists. J Med Chem 57:2429-39 (2014)  
Target
Name:
Histamine H4 receptor
Synonyms:
AXOR35 GPCR105 HH4R HRH4 Histamine H4 receptor Histamine receptor (H3 and H4) SP9144
Type:
G Protein-Coupled Receptor (GPCR)
Mol. Mass.:
44517.02
Organism:
Homo sapiens (Human)
Description:
Binding assays were using CHO cells stably expressing hH4R receptors.
Residue:
390
  
Inhibitor
Name:
BDBM50006767
Synonyms:
CHEMBL3236577
Type:
Small organic molecule
Emp. Form.:
C13H23N5
Mol. Mass.:
249.3552
SMILES:
CN[C@@H]1CCN(C1)c1cc(nc(N)n1)C(C)(C)C
: