Target
Cytidine deaminase
Ligand
BDBM50007037
Substrate
Meas. Tech.
ChEMBL_1337495 (CHEMBL3241963)
Ki
40000±n/a nM
Citation
 Ferraris, DDuvall, BDelahanty, GMistry, BAlt, JRojas, CRowbottom, CSanders, KSchuck, EHuang, KCRedkar, SSlusher, BBTsukamoto, T Design, synthesis, and pharmacological evaluation of fluorinated tetrahydrouridine derivatives as inhibitors of cytidine deaminase. J Med Chem 57:2582-8 (2014)  
Target
Name:
Cytidine deaminase
Synonyms:
CDA CDD_HUMAN Cytidine deaminase (CDA)
Type:
Ezyme
Mol. Mass.:
16185.04
Organism:
Homo sapiens (Human)
Description:
P32320
Residue:
146
  
Inhibitor
Name:
BDBM50007037
Synonyms:
CHEBI:23774 | CHEMBL3237555
Type:
Small organic molecule
Emp. Form.:
C9H14N2O6
Mol. Mass.:
246.2173
SMILES:
OC[C@H]1O[C@H]([C@H](O)[C@@H]1O)N1CCC(=O)NC1=O
: