Target
Proteasome subunit beta type-7
Ligand
BDBM50007204
Substrate
Meas. Tech.
ChEMBL_1338347 (CHEMBL3240083)
IC50
54±n/a nM
Citation
 Kawamura, SUnno, YAsai, AArisawa, MShuto, S Structurally novel highly potent proteasome inhibitors created by the structure-based hybridization of nonpeptidic belactosin derivatives and peptide boronates. J Med Chem 57:2726-35 (2014)  
Target
Name:
Proteasome subunit beta type-7
Synonyms:
Macropain chain Z PSB7_HUMAN Proteasome subunit Z | Z
Type:
PROTEIN
Mol. Mass.:
29968.13
Organism:
Homo sapiens (Human)
Description:
ChEMBL_106197
Residue:
277
  
Inhibitor
Name:
BDBM50007204
Synonyms:
CHEMBL3237872
Type:
Small organic molecule
Emp. Form.:
C22H38BN3O5
Mol. Mass.:
435.365
SMILES:
[H][C@@]12C[C@@]([H])(C1(C)C)[C@]1(C)OB(O[C@]1([H])C2)[C@H](CC(C)C)NC(=O)[C@H](CC(=O)NC)NC(C)=O
: