Target
Glucagon receptor
Ligand
BDBM50007239
Substrate
Meas. Tech.
ChEMBL_1338729 (CHEMBL3242200)
IC50
84±n/a nM
Citation
 DeMong, DDai, XHwa, JMiller, MLin, SIKang, LStamford, AGreenlee, WYu, WWong, MLavey, BKozlowski, JZhou, GYang, DYPatel, BSoriano, AZhai, YSondey, CZhang, HLachowicz, JGrotz, DCox, KMorrison, RAndreani, TCao, YLiang, MMeng, TMcNamara, PWong, JBradley, PFeng, KIBelani, JChen, PDai, PGauuan, JLin, PZhao, H The discovery of N-((2H-tetrazol-5-yl)methyl)-4-((R)-1-((5r,8R)-8-(tert-butyl)-3-(3,5-dichlorophenyl)-2-oxo-1,4-diazaspiro[4.5]dec-3-en-1-yl)-4,4-dimethylpentyl)benzamide (SCH 900822): a potent and selective glucagon receptor antagonist. J Med Chem 57:2601-10 (2014)  
Target
Name:
Glucagon receptor
Synonyms:
GL-R Gcgr
Type:
PROTEIN
Mol. Mass.:
54941.21
Organism:
Mus musculus
Description:
ChEMBL_1338729
Residue:
485
  
Inhibitor
Name:
BDBM50007239
Synonyms:
CHEMBL3238226
Type:
Small organic molecule
Emp. Form.:
C33H43ClN8O2
Mol. Mass.:
619.2
SMILES:
CC(C)(C)CC[C@@H](N1C(=O)C(=N[C@@]11CC[C@@H](CC1)C(C)(C)C)c1cncc(Cl)c1)c1ccc(cc1)C(=O)NCc1nn[nH]n1
: