Target
Heat shock protein HSP 90-alpha
Ligand
BDBM50008059
Substrate
Meas. Tech.
ChEMBL_1337965 (CHEMBL3241242)
Kd
714±n/a nM
Citation
 Wang, TBisson, WHMäser, PScapozza, LPicard, D Differences in conformational dynamics between Plasmodium falciparum and human Hsp90 orthologues enable the structure-based discovery of pathogen-selective inhibitors. J Med Chem 57:2524-35 (2014)  
Target
Name:
Heat shock protein HSP 90-alpha
Synonyms:
HS90A_HUMAN HSP86 HSP90AA1 HSPCA Heat shock 86 kDa Heat shock protein HSP 90-alpha (HSP90) LAP-2 Lipopolysaccharide-associated protein 2 heat shock protein 90kDa alpha (cytosolic), class A member 1 isoform 2
Type:
Molecular Chaperone
Mol. Mass.:
84623.45
Organism:
Homo sapiens (Human)
Description:
P07900
Residue:
732
  
Inhibitor
Name:
BDBM50008059
Synonyms:
CHEBI:5292 | GELDANAMYCIN
Type:
Small organic molecule
Emp. Form.:
C29H40N2O9
Mol. Mass.:
560.6359
SMILES:
CO[C@H]1C[C@H](C)CC2=C(OC)C(=O)C=C(NC(=O)\C(C)=C\C=C/[C@H](OC)[C@@H](OC(N)=O)\C(C)=C\[C@H](C)[C@H]1O)C2=O
: