Target
Heat shock protein HSP 90-alpha
Ligand
BDBM50008261
Substrate
Meas. Tech.
ChEMBL_1338401 (CHEMBL3240454)
IC50
25±n/a nM
Citation
 Taddei, MFerrini, SGiannotti, LCorsi, MManetti, FGiannini, GVesci, LMilazzo, FMAlloatti, DGuglielmi, MBCastorina, MCervoni, MLBarbarino, MFoderà, RCarollo, VPisano, CArmaroli, SCabri, W Synthesis and evaluation of new Hsp90 inhibitors based on a 1,4,5-trisubstituted 1,2,3-triazole scaffold. J Med Chem 57:2258-74 (2014)  
Target
Name:
Heat shock protein HSP 90-alpha
Synonyms:
HS90A_HUMAN HSP86 HSP90AA1 HSPCA Heat shock 86 kDa Heat shock protein HSP 90-alpha (HSP90) LAP-2 Lipopolysaccharide-associated protein 2 heat shock protein 90kDa alpha (cytosolic), class A member 1 isoform 2
Type:
Molecular Chaperone
Mol. Mass.:
84623.45
Organism:
Homo sapiens (Human)
Description:
P07900
Residue:
732
  
Inhibitor
Name:
BDBM50008261
Synonyms:
CHEMBL3234772
Type:
Small organic molecule
Emp. Form.:
C25H33N5O3
Mol. Mass.:
451.5612
SMILES:
CCNC(=O)c1nnn(c1-c1ccc(CN(CC)CC)cc1)-c1cc(C(C)C)c(O)cc1O
: