Target
Carboxypeptidase N catalytic chain
Ligand
BDBM50008273
Substrate
Meas. Tech.
ChEMBL_1339191 (CHEMBL3243354)
IC50
>1000000±n/a nM
Citation
 Brink, MDahlén, AOlsson, TPolla, MSvensson, T Design and synthesis of conformationally restricted inhibitors of active thrombin activatable fibrinolysis inhibitor (TAFIa). Bioorg Med Chem 22:2261-8 (2014)  
Target
Name:
Carboxypeptidase N catalytic chain
Synonyms:
ACBP Arginine carboxypeptidase CPN Carboxypeptidase N catalytic chain Carboxypeptidase N small subunit Kininase-1 Plasma carboxypeptidase B Serum carboxypeptidase N
Type:
PROTEIN
Mol. Mass.:
52293.66
Organism:
Homo sapiens (Human)
Description:
ChEMBL_1496379
Residue:
458
  
Inhibitor
Name:
BDBM50008273
Synonyms:
CHEMBL3235134
Type:
Small organic molecule
Emp. Form.:
C17H27N3O2
Mol. Mass.:
305.4152
SMILES:
NCCC[C@]1(CCc2c(C1)ncn2C1CCCCC1)C(O)=O
: