Target
Tyrosine-protein phosphatase non-receptor type 1
Ligand
BDBM50008518
Substrate
Meas. Tech.
ChEMBL_1335408 (CHEMBL3239059)
IC50
9710±n/a nM
Citation
 Chen, QBXin, XLYang, YLee, SSAisa, HA Highly conjugated norditerpenoid and pyrroloquinoline alkaloids with potent PTP1B inhibitory activity from Nigella glandulifera. J Nat Prod 77:807-12 (2014)  
Target
Name:
Tyrosine-protein phosphatase non-receptor type 1
Synonyms:
PTN1_HUMAN PTPN1 Protein tyrosine phosphatase-1B (PTP1B) Protein-tyrosine phosphatase 1B (PTP1B) Tyrosine-protein phosphatase non-receptor type 1 (PTP1B)
Type:
Protein phosphatase
Mol. Mass.:
49963.76
Organism:
Homo sapiens (Human)
Description:
Human recombinant GST-fusion PTP1B (1-435).
Residue:
435
  
Inhibitor
Name:
BDBM50008518
Synonyms:
CHEMBL3235602
Type:
Small organic molecule
Emp. Form.:
C19H25NO
Mol. Mass.:
283.4079
SMILES:
CC(C)C1=C2C=C3C(C)=CC(C)(C)N=C3C[C@@]2(C)CC1=O
: