Target
Transient receptor potential cation channel subfamily M member 8
Ligand
BDBM50008699
Substrate
Meas. Tech.
ChEMBL_1335865 (CHEMBL3238730)
IC50
47±n/a nM
Citation
 Horne, DBTamayo, NABartberger, MDBo, YClarine, JDavis, CDGore, VKKaller, MRLehto, SGMa, VVNishimura, NNguyen, TTTang, PWang, WYoungblood, BDZhang, MGavva, NRMonenschein, HNorman, MH Optimization of potency and pharmacokinetic properties of tetrahydroisoquinoline transient receptor potential melastatin 8 (TRPM8) antagonists. J Med Chem 57:2989-3004 (2014)  
Target
Name:
Transient receptor potential cation channel subfamily M member 8
Synonyms:
Cmr1 Transient receptor potential M8 protein (TRPM8) Trpm8
Type:
Enzyme
Mol. Mass.:
127633.53
Organism:
Rattus norvegicus (Rat)
Description:
Q8R455
Residue:
1104
  
Inhibitor
Name:
BDBM50008699
Synonyms:
CHEMBL3235968
Type:
Small organic molecule
Emp. Form.:
C20H21F3N2O
Mol. Mass.:
362.3887
SMILES:
CC(C)NC(=O)N1CCc2ccccc2[C@H]1c1ccc(cc1)C(F)(F)F
: