Target
Transient receptor potential cation channel subfamily M member 8
Ligand
BDBM50008702
Substrate
Meas. Tech.
ChEMBL_1335865 (CHEMBL3238730)
IC50
168±n/a nM
Citation
 Horne, DBTamayo, NABartberger, MDBo, YClarine, JDavis, CDGore, VKKaller, MRLehto, SGMa, VVNishimura, NNguyen, TTTang, PWang, WYoungblood, BDZhang, MGavva, NRMonenschein, HNorman, MH Optimization of potency and pharmacokinetic properties of tetrahydroisoquinoline transient receptor potential melastatin 8 (TRPM8) antagonists. J Med Chem 57:2989-3004 (2014)  
Target
Name:
Transient receptor potential cation channel subfamily M member 8
Synonyms:
Cmr1 Transient receptor potential M8 protein (TRPM8) Trpm8
Type:
Enzyme
Mol. Mass.:
127633.53
Organism:
Rattus norvegicus (Rat)
Description:
Q8R455
Residue:
1104
  
Inhibitor
Name:
BDBM50008702
Synonyms:
CHEMBL3235971
Type:
Small organic molecule
Emp. Form.:
C25H20F6N2O
Mol. Mass.:
478.4295
SMILES:
FC(F)(F)C(NC(=O)N1CCc2ccccc2[C@H]1c1ccc(cc1)C(F)(F)F)c1ccccc1
: